Reaction Details
TargetHistone deacetylase 8
LigandBDBM50356639
Substrate/Competitorn/a
Meas. Tech.ChEMBL_785887 (CHEMBL1921156)
IC50 28±n/a nM
Citation Neelarapu, RHolzle, DLVelaparthi, SBai, HBrunsteiner, MBlond, SYPetukhov, PA Design, synthesis, docking, and biological evaluation of novel diazide-containing isoxazole- and pyrazole-based histone deacetylase probes. J Med Chem54:4350-64 (2011) 
 
Histone deacetylase 8
Name:Histone deacetylase 8
Type:Enzyme
Mol. Mass.:41749.60
Organism:Homo sapiens (Human)
Description:Q9BY41
Residue:377
BDBM50356639
NameBDBM50356639
Synonyms:CHEMBL1914705
TypeSmall organic molecule
Emp. Form.C18H23N7O3
Mol. Mass.385.4203
SMILESONC(=O)CCCCCCC(=O)Nc1cnn(Cc2ccc(cc2)N=[N+]=[N-])c1