Reaction Details
TargetProstaglandin D2 receptor 2
LigandBDBM50356674
Substrate/Competitorn/a
Meas. Tech.ChEMBL_785711 (CHEMBL1920639)
Ki 6±n/a nM
Citation Crosignani, SPrêtre, AJorand-Lebrun, CFraboulet, GSeenisamy, JAugustine, JKMissotten, MHumbert, YCleva, CAbla, NDaff, HSchott, OSchneider, MBurgat-Charvillon, FRivron, DHamernig, IArrighi, JFGaudet, MZimmerli, SCJuillard, PJohnson, Z Discovery of potent, selective, and orally bioavailable alkynylphenoxyacetic acid CRTH2 (DP2) receptor antagonists for the treatment of allergic inflammatory diseases. J Med Chem54:7299-317 (2011) 
 
Prostaglandin D2 receptor 2
Name:Prostaglandin D2 receptor 2
Type:Enzyme
Mol. Mass.:43295.45
Organism:Homo sapiens (Human)
Description:Q9Y5Y4
Residue:395
BDBM50356674
NameBDBM50356674
Synonyms:CHEMBL1917589
TypeSmall organic molecule
Emp. Form.C23H17ClO5S
Mol. Mass.440.896
SMILESCc1ccc(cc1C#Cc1cc(Cl)ccc1OCC(O)=O)S(=O)(=O)c1ccccc1