Reaction Details
TargetProstaglandin D2 receptor 2
LigandBDBM50356744
Substrate/Competitorn/a
Meas. Tech.ChEMBL_785711 (CHEMBL1920639)
Ki 12±n/a nM
Citation Crosignani, SPrêtre, AJorand-Lebrun, CFraboulet, GSeenisamy, JAugustine, JKMissotten, MHumbert, YCleva, CAbla, NDaff, HSchott, OSchneider, MBurgat-Charvillon, FRivron, DHamernig, IArrighi, JFGaudet, MZimmerli, SCJuillard, PJohnson, Z Discovery of potent, selective, and orally bioavailable alkynylphenoxyacetic acid CRTH2 (DP2) receptor antagonists for the treatment of allergic inflammatory diseases. J Med Chem54:7299-317 (2011) 
 
Prostaglandin D2 receptor 2
Name:Prostaglandin D2 receptor 2
Type:Enzyme
Mol. Mass.:43295.45
Organism:Homo sapiens (Human)
Description:Q9Y5Y4
Residue:395
BDBM50356744
NameBDBM50356744
Synonyms:CHEMBL1917797
TypeSmall organic molecule
Emp. Form.C21H19NO5S
Mol. Mass.397.444
SMILESCC(C)c1ccc(cc1C#Cc1cc(ccc1OCC(O)=O)C#N)S(C)(=O)=O