Reaction Details
TargetHistamine H4 receptor
LigandBDBM50356881
Substrate/Competitorn/a
Meas. Tech.ChEMBL_785118 (CHEMBL1920856)
Ki 1.5±n/a nM
Citation Mowbray, CEBell, ASClarke, NPCollins, MJones, RMLane, CALiu, WLNewman, SDParadowski, MSchenck, EJSelby, MDSwain, NAWilliams, DH Challenges of drug discovery in novel target space. The discovery and evaluation of PF-3893787: a novel histamine H4 receptor antagonist. Bioorg Med Chem Lett21:6596-602 (2011) 
 
Histamine H4 receptor
Name:Histamine H4 receptor
Type:G Protein-Coupled Receptor (GPCR)
Mol. Mass.:44517.02
Organism:Homo sapiens (Human)
Description:Binding assays were using CHO cells stably expressing hH4R receptors.
Residue:390
BDBM50356881
NameBDBM50356881
Synonyms:CHEMBL1915537
TypeSmall organic molecule
Emp. Form.C14H26N6
Mol. Mass.278.3964
SMILESCNC1CN(C1)c1cc(NCCC(C)(C)C)nc(N)n1