Reaction Details
TargetHistamine H4 receptor
LigandBDBM50356890
Substrate/Competitorn/a
Meas. Tech.ChEMBL_785117 (CHEMBL1920855)
Ki 212±n/a nM
Citation Mowbray, CEBell, ASClarke, NPCollins, MJones, RMLane, CALiu, WLNewman, SDParadowski, MSchenck, EJSelby, MDSwain, NAWilliams, DH Challenges of drug discovery in novel target space. The discovery and evaluation of PF-3893787: a novel histamine H4 receptor antagonist. Bioorg Med Chem Lett21:6596-602 (2011) 
 
Histamine H4 receptor
Name:Histamine H4 receptor
Type:G Protein-Coupled Receptor (GPCR)
Mol. Mass.:44517.02
Organism:Homo sapiens (Human)
Description:Binding assays were using CHO cells stably expressing hH4R receptors.
Residue:390
BDBM50356890
NameBDBM50356890
Synonyms:CHEMBL1915533
TypeSmall organic molecule
Emp. Form.C18H23N5
Mol. Mass.309.4087
SMILESCN1CCN(CC1)c1cc(NC2Cc3ccccc3C2)ncn1