Reaction Details
TargetHistamine receptor H4
LigandBDBM50356884
Substrate/Competitorn/a
Meas. Tech.ChEMBL_785248 (CHEMBL1921329)
Ki 123.03±n/a nM
Citation Mowbray, CEBell, ASClarke, NPCollins, MJones, RMLane, CALiu, WLNewman, SDParadowski, MSchenck, EJSelby, MDSwain, NAWilliams, DH Challenges of drug discovery in novel target space. The discovery and evaluation of PF-3893787: a novel histamine H4 receptor antagonist. Bioorg Med Chem Lett21:6596-602 (2011) 
 
Histamine receptor H4
Name:Histamine receptor H4
Type:Enzyme Catalytic Domain
Mol. Mass.:44536.99
Organism:GUINEA PIG
Description:HISTAMINE H4 HRH4 GUINEA PIG::Q91ZY3
Residue:389
BDBM50356884
NameBDBM50356884
Synonyms:CHEMBL1915540
TypeSmall organic molecule
Emp. Form.C13H22N6
Mol. Mass.262.354
SMILESCN[C@@H]1CCN(C1)c1cc(NCC2CC2)nc(N)n1