Reaction Details
TargetMatrix metalloproteinase-9
LigandBDBM50356945
Substrate/Competitorn/a
Meas. Tech.ChEMBL_787971 (CHEMBL1918905)
IC50 1.3±n/a nM
Citation Wilson, LJWang, BYang, SMScannevin, RHBurke, SLKarnachi, PRhodes, KJMurray, WV Discovery of novel Cobactin-T based matrix metalloproteinase inhibitors via a ring closing metathesis strategy. Bioorg Med Chem Lett21:6485-90 (2011) 
 
Matrix metalloproteinase-9
Name:Matrix metalloproteinase-9
Type:Enzyme
Mol. Mass.:78452.28
Organism:Homo sapiens (Human)
Description:P14780
Residue:707
BDBM50356945
NameBDBM50356945
Synonyms:CHEMBL1916053
TypeSmall organic molecule
Emp. Form.C19H19ClN2O5S
Mol. Mass.422.883
SMILESCC1=CC[C@@H](NS(=O)(=O)c2ccc(Oc3ccc(Cl)cc3)cc2)C(=O)N(O)C1