Reaction Details
Target72 kDa type IV collagenase
LigandBDBM50356949
Substrate/Competitorn/a
Meas. Tech.ChEMBL_787970 (CHEMBL1918904)
IC50 1±n/a nM
Citation Wilson, LJWang, BYang, SMScannevin, RHBurke, SLKarnachi, PRhodes, KJMurray, WV Discovery of novel Cobactin-T based matrix metalloproteinase inhibitors via a ring closing metathesis strategy. Bioorg Med Chem Lett21:6485-90 (2011) 
 
72 kDa type IV collagenase
Name:72 kDa type IV collagenase
Type:Enzyme
Mol. Mass.:73870.36
Organism:Homo sapiens (Human)
Description: P08253
Residue:660
BDBM50356949
NameBDBM50356949
Synonyms:CHEMBL1916057
TypeSmall organic molecule
Emp. Form.C18H18N2O5S
Mol. Mass.374.411
SMILESON1CC=CC[C@@H](NS(=O)(=O)c2ccc(Oc3ccccc3)cc2)C1=O