Reaction Details
Target72 kDa type IV collagenase
LigandBDBM50356950
Substrate/Competitorn/a
Meas. Tech.ChEMBL_787970 (CHEMBL1918904)
IC50 2±n/a nM
Citation Wilson, LJWang, BYang, SMScannevin, RHBurke, SLKarnachi, PRhodes, KJMurray, WV Discovery of novel Cobactin-T based matrix metalloproteinase inhibitors via a ring closing metathesis strategy. Bioorg Med Chem Lett21:6485-90 (2011) 
 
72 kDa type IV collagenase
Name:72 kDa type IV collagenase
Type:Enzyme
Mol. Mass.:73870.36
Organism:Homo sapiens (Human)
Description: P08253
Residue:660
BDBM50356950
NameBDBM50356950
Synonyms:CHEMBL1916201
TypeSmall organic molecule
Emp. Form.C19H20N2O6S
Mol. Mass.404.437
SMILESCOc1ccc(Oc2ccc(cc2)S(=O)(=O)N[C@@H]2CC=CCN(O)C2=O)cc1