Reaction Details
TargetD(2) dopamine receptor
LigandBDBM43822
Substrate/Competitorn/a
Meas. Tech.ChEMBL_788043 (CHEMBL1919022)
IC50 4500±n/a nM
Citation Lebois, EPDigby, GJSheffler, DJMelancon, BJTarr, JCCho, HPMiller, NRMorrison, RBridges, TMXiang, ZScott Daniels, JWood, MRConn, PJLindsley, CW Development of a highly selective, orally bioavailable and CNS penetrant M1 agonist derived from the MLPCN probe ML071. Bioorg Med Chem Lett21:6451-5 (2011) 
 
D(2) dopamine receptor
Name:D(2) dopamine receptor
Type:Cell-surface receptors
Mol. Mass.:50647.10
Organism:Homo sapiens (Human)
Description:P14416
Residue:443
BDBM43822
NameBDBM43822
Synonyms:4-[2-(o-toluoylamino)ethylamino]piperidine-1-carboxylic acid ethyl ester;hydrochloride CHEMBL1624037 cid_25010775 ethyl 4-[2-[(2-methylphenyl)carbonylamino]ethylamino]piperidine-1-carboxylate;hydrochloride
TypeSmall organic molecule
Emp. Form.C18H27N3O3
Mol. Mass.333.4253
SMILESCCOC(=O)N1CCC(CC1)NCCNC(=O)c1ccccc1C