Reaction Details
TargetMuscarinic acetylcholine receptor M3
LigandBDBM50356971
Substrate/Competitorn/a
Meas. Tech.ChEMBL_788048 (CHEMBL1919027)
EC50>10000±n/a nM
Citation Lebois, EPDigby, GJSheffler, DJMelancon, BJTarr, JCCho, HPMiller, NRMorrison, RBridges, TMXiang, ZScott Daniels, JWood, MRConn, PJLindsley, CW Development of a highly selective, orally bioavailable and CNS penetrant M1 agonist derived from the MLPCN probe ML071. Bioorg Med Chem Lett21:6451-5 (2011) 
 
Muscarinic acetylcholine receptor M3
Name:Muscarinic acetylcholine receptor M3
Type:Enzyme Catalytic Domain
Mol. Mass.:66086.66
Organism:RAT
Description:Cholinergic, muscarinic M3 CHRM3 RAT::P08483
Residue:589
BDBM50356971
NameBDBM50356971
Synonyms:CHEMBL1916228
TypeSmall organic molecule
Emp. Form.C21H31N3O4
Mol. Mass.389.4885
SMILESCCOC(=O)N1CCC(CC1)N1CCC[C@H](C1)NC(=O)c1cccc(OC)c1