Reaction Details
TargetAndrogen receptor
LigandBDBM50356982
Substrate/Competitorn/a
Meas. Tech.ChEMBL_788156 (CHEMBL1919237)
IC50 126±n/a nM
Citation Guo, CLinton, AKephart, SOrnelas, MPairish, MGonzalez, JGreasley, SNagata, ABurke, BJEdwards, MHosea, NKang, PHu, WEngebretsen, JBriere, DShi, MGukasyan, HRichardson, PDack, KUnderwood, TJohnson, PMorell, AFelstead, RKuruma, HMatsimoto, HZoubeidi, AGleave, MLos, GFanjul, AN Discovery of aryloxy tetramethylcyclobutanes as novel androgen receptor antagonists. J Med Chem54:7693-704 (2011) 
 
Androgen receptor
Name:Androgen receptor
Type:Receptor
Mol. Mass.:99185.27
Organism:Homo sapiens (Human)
Description:CHO cells were stably transfected with human AR gene.
Residue:920
BDBM50356982
NameBDBM50356982
Synonyms:CHEMBL1916239
TypeSmall organic molecule
Emp. Form.C18H21F3N2O2
Mol. Mass.354.3667
SMILESCC(=O)N[C@H]1C(C)(C)[C@H](Oc2ccc(C#N)c(c2)C(F)(F)F)C1(C)C