Reaction Details
TargetAndrogen receptor
LigandBDBM50356993
Substrate/Competitorn/a
Meas. Tech.ChEMBL_788156 (CHEMBL1919237)
IC50 136±n/a nM
Citation Guo, CLinton, AKephart, SOrnelas, MPairish, MGonzalez, JGreasley, SNagata, ABurke, BJEdwards, MHosea, NKang, PHu, WEngebretsen, JBriere, DShi, MGukasyan, HRichardson, PDack, KUnderwood, TJohnson, PMorell, AFelstead, RKuruma, HMatsimoto, HZoubeidi, AGleave, MLos, GFanjul, AN Discovery of aryloxy tetramethylcyclobutanes as novel androgen receptor antagonists. J Med Chem54:7693-704 (2011) 
 
Androgen receptor
Name:Androgen receptor
Type:Receptor
Mol. Mass.:99185.27
Organism:Homo sapiens (Human)
Description:CHO cells were stably transfected with human AR gene.
Residue:920
BDBM50356993
NameBDBM50356993
Synonyms:CHEMBL1916249
TypeSmall organic molecule
Emp. Form.C22H27ClN4O3
Mol. Mass.430.928
SMILESCOCCn1ccc(n1)C(=O)N[C@H]1C(C)(C)[C@H](Oc2ccc(C#N)c(Cl)c2)C1(C)C