Reaction Details
TargetCollagenase 3
LigandBDBM50357029
Substrate/Competitorn/a
Meas. Tech.ChEMBL_788431 (CHEMBL1918196)
IC50 0.6±n/a nM
Citation Tommasi, RAWeiler, SMcQuire, LWRogel, OChambers, MClark, KDoughty, JFang, JGanu, VGrob, JGoldberg, RGoldstein, RLavoie, SKulathila, RMacchia, WMelton, RSpringer, CWalker, MZhang, JZhu, LShultz, M Potent and selective 2-naphthylsulfonamide substituted hydroxamic acid inhibitors of matrix metalloproteinase-13. Bioorg Med Chem Lett21:6440-5 (2011) 
 
Collagenase 3
Name:Collagenase 3
Type:Enzyme
Mol. Mass.:53808.06
Organism:Homo sapiens (Human)
Description:P45452
Residue:471
BDBM50357029
NameBDBM50357029
Synonyms:CHEMBL1916653
TypeSmall organic molecule
Emp. Form.C21H30N2O4S
Mol. Mass.406.539
SMILESCC(C)CCN([C@H](CC(C)C)C(=O)NO)S(=O)(=O)c1ccc2ccccc2c1