Reaction Details
TargetCollagenase 3
LigandBDBM50357050
Substrate/Competitorn/a
Meas. Tech.ChEMBL_788431 (CHEMBL1918196)
IC50 1.8±n/a nM
Citation Tommasi, RAWeiler, SMcQuire, LWRogel, OChambers, MClark, KDoughty, JFang, JGanu, VGrob, JGoldberg, RGoldstein, RLavoie, SKulathila, RMacchia, WMelton, RSpringer, CWalker, MZhang, JZhu, LShultz, M Potent and selective 2-naphthylsulfonamide substituted hydroxamic acid inhibitors of matrix metalloproteinase-13. Bioorg Med Chem Lett21:6440-5 (2011) 
 
Collagenase 3
Name:Collagenase 3
Type:Enzyme
Mol. Mass.:53808.06
Organism:Homo sapiens (Human)
Description:P45452
Residue:471
BDBM50357050
NameBDBM50357050
Synonyms:CHEMBL1916838
TypeSmall organic molecule
Emp. Form.C18H26N2O4S2
Mol. Mass.398.54
SMILESCC(C)CCN([C@H](C(C)C)C(=O)NO)S(=O)(=O)c1ccc2sccc2c1