Reaction Details
TargetProstaglandin D2 receptor 2
LigandBDBM50357141
Substrate/Competitorn/a
Meas. Tech.ChEMBL_787459 (CHEMBL1919378)
IC50 11±n/a nM
Citation Luker, TBonnert, RBrough, SCook, ARDickinson, MRDougall, ILogan, CMohammed, RTPaine, SSanganee, HJSargent, CSchmidt, JATeague, SThom, S Substituted indole-1-acetic acids as potent and selective CRTh2 antagonists-discovery of AZD1981. Bioorg Med Chem Lett21:6288-92 (2011) 
 
Prostaglandin D2 receptor 2
Name:Prostaglandin D2 receptor 2
Type:Enzyme
Mol. Mass.:43295.45
Organism:Homo sapiens (Human)
Description:Q9Y5Y4
Residue:395
BDBM50357141
NameBDBM50357141
Synonyms:CHEMBL1917455
TypeSmall organic molecule
Emp. Form.C18H13ClF3NO3
Mol. Mass.383.749
SMILESCc1c(Oc2ccc(Cl)cc2)c2cc(ccc2n1CC(O)=O)C(F)(F)F