Reaction Details
TargetProstaglandin D2 receptor 2
LigandBDBM50357120
Substrate/Competitorn/a
Meas. Tech.ChEMBL_787459 (CHEMBL1919378)
IC50 13±n/a nM
Citation Luker, TBonnert, RBrough, SCook, ARDickinson, MRDougall, ILogan, CMohammed, RTPaine, SSanganee, HJSargent, CSchmidt, JATeague, SThom, S Substituted indole-1-acetic acids as potent and selective CRTh2 antagonists-discovery of AZD1981. Bioorg Med Chem Lett21:6288-92 (2011) 
 
Prostaglandin D2 receptor 2
Name:Prostaglandin D2 receptor 2
Type:Enzyme
Mol. Mass.:43295.45
Organism:Homo sapiens (Human)
Description:Q9Y5Y4
Residue:395
BDBM50357120
NameBDBM50357120
Synonyms:CHEMBL1917419
TypeSmall organic molecule
Emp. Form.C17H13Cl2NO2S
Mol. Mass.366.262
SMILESCc1c(Sc2ccc(Cl)cc2)c2cc(Cl)ccc2n1CC(O)=O