Reaction Details
TargetSubstance-P receptor
LigandBDBM50357168
Substrate/Competitorn/a
Meas. Tech.ChEMBL_787726 (CHEMBL1918309)
IC50 0.054±n/a nM
Citation Shirai, JYoshikawa, TYamashita, MYamamoto, YKawamoto, MTarui, NKamo, IHashimoto, TIkeura, Y Design, structure-activity relationship, and highly efficient asymmetric synthesis of 3-phenyl-4-benzylaminopiperidine derivatives as novel neurokinin-1 receptor antagonists. Bioorg Med Chem19:6430-46 (2011) 
 
Substance-P receptor
Name:Substance-P receptor
Type:G Protein-Coupled Receptor (GPCR)
Mol. Mass.:46254.43
Organism:Homo sapiens (Human)
Description:P25103
Residue:407
BDBM50357168
NameBDBM50357168
Synonyms:CHEMBL1917865
TypeSmall organic molecule
Emp. Form.C26H30F3N7O3
Mol. Mass.545.5567
SMILESCOc1ccc(cc1CN[C@H]1CCN(C[C@H]1c1ccccc1)C(=O)CCNC(C)=O)-n1nnnc1C(F)(F)F