Reaction Details
TargetcGMP-specific 3',5'-cyclic phosphodiesterase
LigandBDBM50357255
Substrate/Competitorn/a
Meas. Tech.ChEMBL_788276 (CHEMBL1919539)
IC50 0.280000±n/a nM
Citation Hughes, ROMaddux, TJoseph Rogier, DLu, SWalker, JKJon Jacobsen, ERumsey, JMZheng, YMacinnes, ABond, BRHan, S Investigation of the pyrazinones as PDE5 inhibitors: evaluation of regioisomeric projections into the solvent region. Bioorg Med Chem Lett21:6348-52 (2011) 
 
cGMP-specific 3',5'-cyclic phosphodiesterase
Name:cGMP-specific 3',5'-cyclic phosphodiesterase
Type:Protein
Mol. Mass.:99975.83
Organism:Homo sapiens (Human)
Description:O76074
Residue:875
BDBM50357255
NameBDBM50357255
Synonyms:CHEMBL1916302
TypeSmall organic molecule
Emp. Form.C22H28N6O4
Mol. Mass.440.4955
SMILESCCCOCCn1c2cc(nnc2c(nc1=O)N1CCC(O)CC1)-c1ccc(OC)nc1