Reaction Details
TargetcGMP-specific 3',5'-cyclic phosphodiesterase
LigandBDBM50357235
Substrate/Competitorn/a
Meas. Tech.ChEMBL_788276 (CHEMBL1919539)
IC50 0.100000±n/a nM
Citation Hughes, ROMaddux, TJoseph Rogier, DLu, SWalker, JKJon Jacobsen, ERumsey, JMZheng, YMacinnes, ABond, BRHan, S Investigation of the pyrazinones as PDE5 inhibitors: evaluation of regioisomeric projections into the solvent region. Bioorg Med Chem Lett21:6348-52 (2011) 
 
cGMP-specific 3',5'-cyclic phosphodiesterase
Name:cGMP-specific 3',5'-cyclic phosphodiesterase
Type:Protein
Mol. Mass.:99975.83
Organism:Homo sapiens (Human)
Description:O76074
Residue:875
BDBM50357235
NameBDBM50357235
Synonyms:CHEMBL1916290
TypeSmall organic molecule
Emp. Form.C23H31N5O4
Mol. Mass.441.5233
SMILESCCCOCCn1c2cc(ncc2c(NCCOC(C)C)nc1=O)-c1ccc(OC)nc1