Reaction Details
TargetHigh affinity cAMP-specific and IBMX-insensitive 3',5'-cyclic phosphodiesterase 8B
LigandBDBM50357234
Substrate/Competitorn/a
Meas. Tech.ChEMBL_788343 (CHEMBL1918024)
IC50>2000±n/a nM
Citation Hughes, ROMaddux, TJoseph Rogier, DLu, SWalker, JKJon Jacobsen, ERumsey, JMZheng, YMacinnes, ABond, BRHan, S Investigation of the pyrazinones as PDE5 inhibitors: evaluation of regioisomeric projections into the solvent region. Bioorg Med Chem Lett21:6348-52 (2011) 
 
High affinity cAMP-specific and IBMX-insensitive 3',5'-cyclic phosphodiesterase 8B
Name:High affinity cAMP-specific and IBMX-insensitive 3',5'-cyclic phosphodiesterase 8B
Type:PROTEIN
Mol. Mass.:98984.88
Organism:Homo sapiens (Human)
Description:ChEMBL_876321
Residue:885
BDBM50357234
NameBDBM50357234
Synonyms:CHEMBL1916475
TypeSmall organic molecule
Emp. Form.C23H30N6O4
Mol. Mass.454.5221
SMILESCCCOCCn1c2cc(nnc2c(NC2CCC(O)CC2)nc1=O)-c1ccc(OC)nc1