Reaction Details
TargetHistamine H4 receptor
LigandBDBM50357265
Substrate/Competitorn/a
Meas. Tech.ChEMBL_788365 (CHEMBL1918046)
Ki 34900±n/a nM
Citation Masood, MASelby, MDBell, ASMansfield, ACGardner, MSmith, GFLane, CKenyon-Edwards, HOsborne, RJones, RMLiu, WLBrown, CDClarke, NPerrucio, FMowbray, CE Discovery of a series of potent and selective human H4 antagonists using ligand efficiency and libraries to explore structure-activity relationship (SAR). Bioorg Med Chem Lett21:6591-5 (2011) 
 
Histamine H4 receptor
Name:Histamine H4 receptor
Type:G Protein-Coupled Receptor (GPCR)
Mol. Mass.:44517.02
Organism:Homo sapiens (Human)
Description:Binding assays were using CHO cells stably expressing hH4R receptors.
Residue:390
BDBM50357265
NameBDBM50357265
Synonyms:CHEMBL1916491
TypeSmall organic molecule
Emp. Form.C18H20F3N5O
Mol. Mass.379.3795
SMILESCN1CCN(CC1)c1cc(ncn1)C(=O)NCc1cccc(c1)C(F)(F)F