Reaction Details
TargetHistamine H4 receptor
LigandBDBM50060682
Substrate/Competitorn/a
Meas. Tech.ChEMBL_788365 (CHEMBL1918046)
Ki 1060±n/a nM
Citation Masood, MASelby, MDBell, ASMansfield, ACGardner, MSmith, GFLane, CKenyon-Edwards, HOsborne, RJones, RMLiu, WLBrown, CDClarke, NPerrucio, FMowbray, CE Discovery of a series of potent and selective human H4 antagonists using ligand efficiency and libraries to explore structure-activity relationship (SAR). Bioorg Med Chem Lett21:6591-5 (2011) 
 
Histamine H4 receptor
Name:Histamine H4 receptor
Type:G Protein-Coupled Receptor (GPCR)
Mol. Mass.:44517.02
Organism:Homo sapiens (Human)
Description:Binding assays were using CHO cells stably expressing hH4R receptors.
Residue:390
BDBM50060682
NameBDBM50060682
Synonyms:2-(4-Methyl-piperazin-1-yl)-quinoxaline | CHEMBL123137
TypeSmall organic molecule
Emp. Form.C13H16N4
Mol. Mass.228.2929
SMILESCN1CCN(CC1)c1cnc2ccccc2n1