Reaction Details
TargetTyrosine-protein kinase Lyn
LigandBDBM50357314
Substrate/Competitorn/a
Meas. Tech.ChEMBL_788549 (CHEMBL1918489)
IC50 21.3±n/a nM
Citation Kim, KHMaderna, ASchnute, MEHegen, MMohan, SMiyashiro, JLin, LLi, EKeegan, SLussier, JWrocklage, CNickerson-Nutter, CLWittwer, AJSoutter, HCaspers, NHan, SKurumbail, RDunussi-Joannopoulos, KDouhan, JWissner, A Imidazo[1,5-a]quinoxalines as irreversible BTK inhibitors for the treatment of rheumatoid arthritis. Bioorg Med Chem Lett21:6258-63 (2011) 
 
Tyrosine-protein kinase Lyn
Name:Tyrosine-protein kinase Lyn
Type:Protein
Mol. Mass.:58575.92
Organism:Homo sapiens (Human)
Description:P07948
Residue:512
BDBM50357314
NameBDBM50357314
Synonyms:CHEMBL1916713
TypeSmall organic molecule
Emp. Form.C27H28N6O2
Mol. Mass.468.5502
SMILESCOc1cc2nc(Nc3ccccc3C)c3cncn3c2cc1NC(=O)C#CCN1CCCCC1