Reaction Details
TargetTyrosine-protein kinase Lyn
LigandBDBM50357321
Substrate/Competitorn/a
Meas. Tech.ChEMBL_788549 (CHEMBL1918489)
IC50 1.55±n/a nM
Citation Kim, KHMaderna, ASchnute, MEHegen, MMohan, SMiyashiro, JLin, LLi, EKeegan, SLussier, JWrocklage, CNickerson-Nutter, CLWittwer, AJSoutter, HCaspers, NHan, SKurumbail, RDunussi-Joannopoulos, KDouhan, JWissner, A Imidazo[1,5-a]quinoxalines as irreversible BTK inhibitors for the treatment of rheumatoid arthritis. Bioorg Med Chem Lett21:6258-63 (2011) 
 
Tyrosine-protein kinase Lyn
Name:Tyrosine-protein kinase Lyn
Type:Protein
Mol. Mass.:58575.92
Organism:Homo sapiens (Human)
Description:P07948
Residue:512
BDBM50357321
NameBDBM50357321
Synonyms:CHEMBL1916879
TypeSmall organic molecule
Emp. Form.C32H30F3N7O2
Mol. Mass.601.6215
SMILESCN(C)C\C=C\C(=O)N(C)c1ccc2nc(Nc3cc(NC(=O)c4cccc(c4)C(F)(F)F)ccc3C)c3cncn3c2c1