Reaction Details
TargetTyrosine-protein kinase Lyn
LigandBDBM50357348
Substrate/Competitorn/a
Meas. Tech.ChEMBL_788549 (CHEMBL1918489)
IC50 19±n/a nM
Citation Kim, KHMaderna, ASchnute, MEHegen, MMohan, SMiyashiro, JLin, LLi, EKeegan, SLussier, JWrocklage, CNickerson-Nutter, CLWittwer, AJSoutter, HCaspers, NHan, SKurumbail, RDunussi-Joannopoulos, KDouhan, JWissner, A Imidazo[1,5-a]quinoxalines as irreversible BTK inhibitors for the treatment of rheumatoid arthritis. Bioorg Med Chem Lett21:6258-63 (2011) 
 
Tyrosine-protein kinase Lyn
Name:Tyrosine-protein kinase Lyn
Type:Protein
Mol. Mass.:58575.92
Organism:Homo sapiens (Human)
Description:P07948
Residue:512
BDBM50357348
NameBDBM50357348
Synonyms:CHEMBL1916906
TypeSmall organic molecule
Emp. Form.C18H16FN5
Mol. Mass.321.3515
SMILESCNc1cc2c(cc1F)nc(Nc1ccccc1C)c1cncn21