Reaction Details
TargetEphrin type-B receptor 3
LigandBDBM50357333
Substrate/Competitorn/a
Meas. Tech.ChEMBL_787283 (CHEMBL1919061)
IC50 350±n/a nM
Citation Kim, KHMaderna, ASchnute, MEHegen, MMohan, SMiyashiro, JLin, LLi, EKeegan, SLussier, JWrocklage, CNickerson-Nutter, CLWittwer, AJSoutter, HCaspers, NHan, SKurumbail, RDunussi-Joannopoulos, KDouhan, JWissner, A Imidazo[1,5-a]quinoxalines as irreversible BTK inhibitors for the treatment of rheumatoid arthritis. Bioorg Med Chem Lett21:6258-63 (2011) 
 
Ephrin type-B receptor 3
Name:Ephrin type-B receptor 3
Type:Protein
Mol. Mass.:110326.17
Organism:Homo sapiens (Human)
Description:P54753
Residue:998
BDBM50357333
NameBDBM50357333
Synonyms:CHEMBL1916891
TypeSmall organic molecule
Emp. Form.C24H25FN6O
Mol. Mass.432.4933
SMILESCN(C)C\C=C\C(=O)N(C)c1cc2c(cc1F)nc(Nc1ccccc1C)c1cncn21