Reaction Details
TargetProstaglandin G/H synthase 2
LigandBDBM22369
Substrate/Competitorn/a
Meas. Tech.ChEMBL_787579 (CHEMBL1917972)
IC50 170±n/a nM
Citation Tan, CMChen, GSChen, CSChang, PTChern, JW Design, synthesis and biological evaluation of benzo[1.3.2]dithiazolium ylide 1,1-dioxide derivatives as potential dual cyclooxygenase-2/5-lipoxygenase inhibitors. Bioorg Med Chem19:6316-28 (2011) 
 
Prostaglandin G/H synthase 2
Name:Prostaglandin G/H synthase 2
Type:Enzyme
Mol. Mass.:69003.89
Organism:Homo sapiens (Human)
Description:Recombinant Cox-2 provided by Cayman (Cayman Chemical Co.,Ann Arbor, MI).
Residue:604
BDBM22369
NameBDBM22369
Synonyms:4-(4-methanesulfonylphenyl)-3-phenyl-2,5-dihydrofuran-2-one MK 0966 US11478464, Compound Rofecoxib | US11786535, Compound Rofecoxib
TypeSmall organic molecule
Emp. Form.C17H14O4S
Mol. Mass.314.356
SMILESCS(=O)(=O)c1ccc(cc1)C1=C(C(=O)OC1)c1ccccc1