Reaction Details
TargetPolyunsaturated fatty acid 5-lipoxygenase
LigandBDBM22372
Substrate/Competitorn/a
Meas. Tech.ChEMBL_787580 (CHEMBL1917973)
IC50 25±n/a nM
Citation Tan, CMChen, GSChen, CSChang, PTChern, JW Design, synthesis and biological evaluation of benzo[1.3.2]dithiazolium ylide 1,1-dioxide derivatives as potential dual cyclooxygenase-2/5-lipoxygenase inhibitors. Bioorg Med Chem19:6316-28 (2011) 
 
Polyunsaturated fatty acid 5-lipoxygenase
Name:Polyunsaturated fatty acid 5-lipoxygenase
Type:Enzyme
Mol. Mass.:77972.74
Organism:Homo sapiens (Human)
Description:Recombinant protein was purified from E. coli lysate. After ammonium sulfate precipitation and subsequent steps, the supernatant (S100) was used for 5-LO activity assay.
Residue:674
BDBM22372
NameBDBM22372
Synonyms:4-[(2R,3S)-4-(3,4-dihydroxyphenyl)-2,3-dimethylbutyl]benzene-1,2-diol CHEMBL313972 NDGA | Nordihydroguaiaretic Acid
TypeAntioxidant
Emp. Form.C18H22O4
Mol. Mass.302.3649
SMILESC[C@@H](Cc1ccc(O)c(O)c1)[C@H](C)Cc1ccc(O)c(O)c1