Reaction Details
TargetPolyunsaturated fatty acid 5-lipoxygenase
LigandBDBM22372
Substrate/Competitorn/a
Meas. Tech.ChEMBL_787591 (CHEMBL1917984)
IC50 400±n/a nM
Citation Shaari, KSuppaiah, VWai, LKStanslas, JTejo, BAIsraf, DAAbas, FIsmail, ISShuaib, NHZareen, SLajis, NH Bioassay-guided identification of an anti-inflammatory prenylated acylphloroglucinol from Melicope ptelefolia and molecular insights into its interaction with 5-lipoxygenase. Bioorg Med Chem19:6340-7 (2011) 
 
Polyunsaturated fatty acid 5-lipoxygenase
Name:Polyunsaturated fatty acid 5-lipoxygenase
Type:PROTEIN
Mol. Mass.:77961.27
Organism:Mus musculus
Description:ChEMBL_675639
Residue:674
BDBM22372
NameBDBM22372
Synonyms:4-[(2R,3S)-4-(3,4-dihydroxyphenyl)-2,3-dimethylbutyl]benzene-1,2-diol CHEMBL313972 NDGA | Nordihydroguaiaretic Acid
TypeAntioxidant
Emp. Form.C18H22O4
Mol. Mass.302.3649
SMILESC[C@@H](Cc1ccc(O)c(O)c1)[C@H](C)Cc1ccc(O)c(O)c1