Reaction Details
Target17-beta-hydroxysteroid dehydrogenase type 2
LigandBDBM50357463
Substrate/Competitorn/a
Meas. Tech.ChEMBL_787302 (CHEMBL1919080)
IC50 31±n/a nM
Citation Wetzel, MMarchais-Oberwinkler, SPerspicace, EMöller, GAdamski, JHartmann, RW Introduction of an electron withdrawing group on the hydroxyphenylnaphthol scaffold improves the potency of 17ß-hydroxysteroid dehydrogenase type 2 (17ß-HSD2) inhibitors. J Med Chem54:7547-57 (2011) 
 
17-beta-hydroxysteroid dehydrogenase type 2
Name:17-beta-hydroxysteroid dehydrogenase type 2
Type:Oxidoreductase; single-pass type II membrane protein
Mol. Mass.:42795.29
Organism:Homo sapiens (Human)
Description:Enzyme was partially purified from human placenta.
Residue:387
BDBM50357463
NameBDBM50357463
Synonyms:CHEMBL1917897
TypeSmall organic molecule
Emp. Form.C17H11F3O2
Mol. Mass.304.2632
SMILESOc1ccc(cc1C(F)(F)F)-c1ccc2c(O)cccc2c1