Reaction Details
TargetBeta-secretase 1
LigandBDBM16047
Substrate/Competitorn/a
Meas. Tech.ChEMBL_787404 (CHEMBL1919283)
IC50 10±n/a nM
Citation Thompson, LAShi, JDecicco, CPTebben, AJOlson, REBoy, KMGuernon, JMGood, ACLiauw, AZheng, CCopeland, RACombs, APTrainor, GLCamac, DMMuckelbauer, JKLentz, KAGrace, JEBurton, CRToyn, JHBarten, DMMarcinkeviciene, JMeredith, JEAlbright, CFMacor, JE Synthesis and in vivo evaluation of cyclic diaminopropane BACE-1 inhibitors. Bioorg Med Chem Lett21:6909-15 (2011) 
 
Beta-secretase 1
Name:Beta-secretase 1
Type:Protein
Mol. Mass.:55755.10
Organism:Homo sapiens (Human)
Description:P56817
Residue:501
BDBM16047
NameBDBM16047
Synonyms:(4S)-4-[(2S)-2-[(2R,4S,5S)-5-[(2S)-2-[(2S)-2-[(4S)-4-amino-4-formamidobutanoic acid]-3-methylbutanamido]butanediamido]-4-hydroxy-2,7-dimethyloctanamido]propanamido]-4-{[(1S)-1-carboxy-2-phenylethyl]carbamoyl}butanoic acid EVNXXAEF OM99-2
Typepolypeptide
Emp. Form.C41H64N8O14
Mol. Mass.892.9921
SMILESCC(C)C[C@H](NC(=O)[C@H](CC(N)=O)NC(=O)[C@@H](NC(=O)[C@@H](N)CCC(O)=O)C(C)C)[C@@H](O)C[C@@H](C)C(=O)N[C@@H](C)C(=O)N[C@@H](CCC(O)=O)C(=O)N[C@@H](Cc1ccccc1)C(O)=O