Reaction Details
TargetAromatase
LigandBDBM50357544
Substrate/Competitorn/a
Meas. Tech.ChEMBL_787696 (CHEMBL1918238)
IC50 47300±n/a nM
Citation Shen, LPark, EJKondratyuk, TPGuendisch, DMarler, LPezzuto, JMWright, ADSun, D Design, synthesis, and biological evaluation of callophycin A and analogues as potential chemopreventive and anticancer agents. Bioorg Med Chem19:6182-95 (2011) 
 
Aromatase
Name:Aromatase
Type:Enzyme
Mol. Mass.:57888.92
Organism:Homo sapiens (Human)
Description:P11511
Residue:503
BDBM50357544
NameBDBM50357544
Synonyms:CHEMBL1915167
TypeSmall organic molecule
Emp. Form.C17H21N3O3
Mol. Mass.315.3669
SMILESCOC(=O)[C@@H]1Cc2c(CN1C(=O)NC(C)C)[nH]c1ccccc21