Reaction Details
TargetNitric oxide synthase, inducible
LigandBDBM50357550
Substrate/Competitorn/a
Meas. Tech.ChEMBL_787699 (CHEMBL1918241)
IC50 23100±n/a nM
Citation Shen, LPark, EJKondratyuk, TPGuendisch, DMarler, LPezzuto, JMWright, ADSun, D Design, synthesis, and biological evaluation of callophycin A and analogues as potential chemopreventive and anticancer agents. Bioorg Med Chem19:6182-95 (2011) 
 
Nitric oxide synthase, inducible
Name:Nitric oxide synthase, inducible
Type:Enzyme
Mol. Mass.:130595.79
Organism:Mus musculus (mouse)
Description:Recombinant enzyme overexpressed in E. coli.
Residue:1144
BDBM50357550
NameBDBM50357550
Synonyms:CHEMBL1915155
TypeSmall organic molecule
Emp. Form.C19H17BrN2O4S
Mol. Mass.449.318
SMILESCOC(=O)[C@@H]1Cc2c(CN1S(=O)(=O)c1ccc(Br)cc1)[nH]c1ccccc21