Reaction Details
TargetNitric oxide synthase, inducible
LigandBDBM50357551
Substrate/Competitorn/a
Meas. Tech.ChEMBL_787699 (CHEMBL1918241)
IC50 32000±n/a nM
Citation Shen, LPark, EJKondratyuk, TPGuendisch, DMarler, LPezzuto, JMWright, ADSun, D Design, synthesis, and biological evaluation of callophycin A and analogues as potential chemopreventive and anticancer agents. Bioorg Med Chem19:6182-95 (2011) 
 
Nitric oxide synthase, inducible
Name:Nitric oxide synthase, inducible
Type:Enzyme
Mol. Mass.:130595.79
Organism:Mus musculus (mouse)
Description:Recombinant enzyme overexpressed in E. coli.
Residue:1144
BDBM50357551
NameBDBM50357551
Synonyms:CHEMBL1915160
TypeSmall organic molecule
Emp. Form.C20H20N2O2
Mol. Mass.320.385
SMILESCOC(=O)[C@@H]1Cc2c(CN1Cc1ccccc1)[nH]c1ccccc21