Reaction Details
TargetProstacyclin receptor
LigandBDBM50351494
Substrate/Competitorn/a
Meas. Tech.ChEMBL_788407 (CHEMBL1918135)
Ki 1400±n/a nM
Citation Iwahashi, MNaganawa, AKinoshita, AShimabukuro, ANishiyama, TOgawa, SMatsunaga, YTsukamoto, KOkada, YMatsumoto, RNambu, FOumi, ROdagaki, YKatagi, JYano, KTani, KNakai, HToda, M Discovery of new orally active prostaglandin D2 receptor antagonists. Bioorg Med Chem19:6935-48 (2011) 
 
Prostacyclin receptor
Name:Prostacyclin receptor
Type:G Protein-Coupled Receptor (GPCR)
Mol. Mass.:40968.22
Organism:Homo sapiens (Human)
Description:The membranes prepared from human platelet were used in binding assay.
Residue:386
BDBM50351494
NameBDBM50351494
Synonyms:CHEMBL1819619
TypeSmall organic molecule
Emp. Form.C26H25ClN2O5
Mol. Mass.480.94
SMILESCN1C[C@@H](COc2ccc(C(=O)Nc3cc(CC(O)=O)ccc3C)c(Cl)c2)Oc2ccccc12