Reaction Details
TargetProstaglandin D2 receptor
LigandBDBM50351489
Substrate/Competitorn/a
Meas. Tech.ChEMBL_788406 (CHEMBL1918134)
Ki 7.7±n/a nM
Citation Iwahashi, MNaganawa, AKinoshita, AShimabukuro, ANishiyama, TOgawa, SMatsunaga, YTsukamoto, KOkada, YMatsumoto, RNambu, FOumi, ROdagaki, YKatagi, JYano, KTani, KNakai, HToda, M Discovery of new orally active prostaglandin D2 receptor antagonists. Bioorg Med Chem19:6935-48 (2011) 
 
Prostaglandin D2 receptor
Name:Prostaglandin D2 receptor
Type:PROTEIN
Mol. Mass.:40018.63
Organism:Mus musculus
Description:ChEMBL_788408
Residue:357
BDBM50351489
NameBDBM50351489
Synonyms:CHEMBL1819614
TypeSmall organic molecule
Emp. Form.C26H25ClN2O5
Mol. Mass.480.94
SMILESCN1C[C@@H](COc2ccc(C(=O)Nc3cc(CC(O)=O)ccc3Cl)c(C)c2)Oc2ccccc12