Reaction Details
TargetProstaglandin D2 receptor
LigandBDBM50351485
Substrate/Competitorn/a
Meas. Tech.ChEMBL_788406 (CHEMBL1918134)
Ki 310±n/a nM
Citation Iwahashi, MNaganawa, AKinoshita, AShimabukuro, ANishiyama, TOgawa, SMatsunaga, YTsukamoto, KOkada, YMatsumoto, RNambu, FOumi, ROdagaki, YKatagi, JYano, KTani, KNakai, HToda, M Discovery of new orally active prostaglandin D2 receptor antagonists. Bioorg Med Chem19:6935-48 (2011) 
 
Prostaglandin D2 receptor
Name:Prostaglandin D2 receptor
Type:PROTEIN
Mol. Mass.:40018.63
Organism:Mus musculus
Description:ChEMBL_788408
Residue:357
BDBM50351485
NameBDBM50351485
Synonyms:CHEMBL1819603
TypeSmall organic molecule
Emp. Form.C25H24N2O5
Mol. Mass.432.4685
SMILESCN1C[C@@H](COc2ccc(cc2)C(=O)Nc2cccc(CC(O)=O)c2)Oc2ccccc12