Reaction Details
TargetProstaglandin D2 receptor
LigandBDBM50357628
Substrate/Competitorn/a
Meas. Tech.ChEMBL_788408 (CHEMBL1918136)
IC50 4.3±n/a nM
Citation Iwahashi, MNaganawa, AKinoshita, AShimabukuro, ANishiyama, TOgawa, SMatsunaga, YTsukamoto, KOkada, YMatsumoto, RNambu, FOumi, ROdagaki, YKatagi, JYano, KTani, KNakai, HToda, M Discovery of new orally active prostaglandin D2 receptor antagonists. Bioorg Med Chem19:6935-48 (2011) 
 
Prostaglandin D2 receptor
Name:Prostaglandin D2 receptor
Type:PROTEIN
Mol. Mass.:40018.63
Organism:Mus musculus
Description:ChEMBL_788408
Residue:357
BDBM50357628
NameBDBM50357628
Synonyms:CHEMBL1915857
TypeSmall organic molecule
Emp. Form.C26H24ClNO6
Mol. Mass.481.925
SMILESCc1cc(OC[C@@H]2COc3ccccc3O2)cc(C)c1C(=O)Nc1cc(CC(O)=O)ccc1Cl