Reaction Details
TargetProstacyclin receptor
LigandBDBM50357633
Substrate/Competitorn/a
Meas. Tech.ChEMBL_788407 (CHEMBL1918135)
Ki 3300±n/a nM
Citation Iwahashi, MNaganawa, AKinoshita, AShimabukuro, ANishiyama, TOgawa, SMatsunaga, YTsukamoto, KOkada, YMatsumoto, RNambu, FOumi, ROdagaki, YKatagi, JYano, KTani, KNakai, HToda, M Discovery of new orally active prostaglandin D2 receptor antagonists. Bioorg Med Chem19:6935-48 (2011) 
 
Prostacyclin receptor
Name:Prostacyclin receptor
Type:G Protein-Coupled Receptor (GPCR)
Mol. Mass.:40968.22
Organism:Homo sapiens (Human)
Description:The membranes prepared from human platelet were used in binding assay.
Residue:386
BDBM50357633
NameBDBM50357633
Synonyms:CHEMBL1915861
TypeSmall organic molecule
Emp. Form.C27H26Cl2N2O5
Mol. Mass.529.412
SMILESCN1C[C@@H](COc2ccc(C(=O)Nc3cc(ccc3Cl)C(C)(C)C(O)=O)c(Cl)c2)Oc2ccccc12