Reaction Details
TargetProstaglandin D2 receptor
LigandBDBM50357635
Substrate/Competitorn/a
Meas. Tech.ChEMBL_788408 (CHEMBL1918136)
IC50 0.7±n/a nM
Citation Iwahashi, MNaganawa, AKinoshita, AShimabukuro, ANishiyama, TOgawa, SMatsunaga, YTsukamoto, KOkada, YMatsumoto, RNambu, FOumi, ROdagaki, YKatagi, JYano, KTani, KNakai, HToda, M Discovery of new orally active prostaglandin D2 receptor antagonists. Bioorg Med Chem19:6935-48 (2011) 
 
Prostaglandin D2 receptor
Name:Prostaglandin D2 receptor
Type:PROTEIN
Mol. Mass.:40018.63
Organism:Mus musculus
Description:ChEMBL_788408
Residue:357
BDBM50357635
NameBDBM50357635
Synonyms:CHEMBL1915863
TypeSmall organic molecule
Emp. Form.C29H31ClN2O5
Mol. Mass.523.02
SMILESCN1C[C@@H](COc2cc(C)c(C(=O)Nc3cc(ccc3Cl)C(C)(C)C(O)=O)c(C)c2)Oc2ccccc12