Reaction Details
TargetProstaglandin D2 receptor
LigandBDBM50357620
Substrate/Competitorn/a
Meas. Tech.ChEMBL_788408 (CHEMBL1918136)
IC50 1±n/a nM
Citation Iwahashi, MNaganawa, AKinoshita, AShimabukuro, ANishiyama, TOgawa, SMatsunaga, YTsukamoto, KOkada, YMatsumoto, RNambu, FOumi, ROdagaki, YKatagi, JYano, KTani, KNakai, HToda, M Discovery of new orally active prostaglandin D2 receptor antagonists. Bioorg Med Chem19:6935-48 (2011) 
 
Prostaglandin D2 receptor
Name:Prostaglandin D2 receptor
Type:PROTEIN
Mol. Mass.:40018.63
Organism:Mus musculus
Description:ChEMBL_788408
Residue:357
BDBM50357620
NameBDBM50357620
Synonyms:CHEMBL1915865
TypeSmall organic molecule
Emp. Form.C29H29ClN2O5
Mol. Mass.521.004
SMILESCN1C[C@@H](COc2cc(C)c(C(=O)Nc3cc(ccc3Cl)C3(CC3)C(O)=O)c(C)c2)Oc2ccccc12