Reaction Details
TargetProstaglandin D2 receptor
LigandBDBM50357636
Substrate/Competitorn/a
Meas. Tech.ChEMBL_788408 (CHEMBL1918136)
IC50 1.4±n/a nM
Citation Iwahashi, MNaganawa, AKinoshita, AShimabukuro, ANishiyama, TOgawa, SMatsunaga, YTsukamoto, KOkada, YMatsumoto, RNambu, FOumi, ROdagaki, YKatagi, JYano, KTani, KNakai, HToda, M Discovery of new orally active prostaglandin D2 receptor antagonists. Bioorg Med Chem19:6935-48 (2011) 
 
Prostaglandin D2 receptor
Name:Prostaglandin D2 receptor
Type:PROTEIN
Mol. Mass.:40018.63
Organism:Mus musculus
Description:ChEMBL_788408
Residue:357
BDBM50357636
NameBDBM50357636
Synonyms:CHEMBL1915866
TypeSmall organic molecule
Emp. Form.C25H20Cl2F2N2O5
Mol. Mass.537.34
SMILESCN1C[C@@H](COc2ccc(C(=O)Nc3cc(ccc3Cl)C(F)(F)C(O)=O)c(Cl)c2)Oc2ccccc12