Reaction Details
TargetProstaglandin D2 receptor
LigandBDBM50351484
Substrate/Competitorn/a
Meas. Tech.ChEMBL_788408 (CHEMBL1918136)
IC50 7.4±n/a nM
Citation Iwahashi, MNaganawa, AKinoshita, AShimabukuro, ANishiyama, TOgawa, SMatsunaga, YTsukamoto, KOkada, YMatsumoto, RNambu, FOumi, ROdagaki, YKatagi, JYano, KTani, KNakai, HToda, M Discovery of new orally active prostaglandin D2 receptor antagonists. Bioorg Med Chem19:6935-48 (2011) 
 
Prostaglandin D2 receptor
Name:Prostaglandin D2 receptor
Type:PROTEIN
Mol. Mass.:40018.63
Organism:Mus musculus
Description:ChEMBL_788408
Residue:357
BDBM50351484
NameBDBM50351484
Synonyms:CHEMBL1819623
TypeSmall organic molecule
Emp. Form.C25H22ClFN2O5
Mol. Mass.484.904
SMILESCN1C[C@@H](COc2ccc(C(=O)Nc3cc(CC(O)=O)ccc3F)c(Cl)c2)Oc2ccccc12