Reaction Details
TargetPhosphatidylinositol 4,5-bisphosphate 3-kinase catalytic subunit alpha isoform
LigandBDBM50357665
Substrate/Competitorn/a
Meas. Tech.ChEMBL_786050 (CHEMBL1921660)
IC50 61±n/a nM
Citation Nishimura, NSiegmund, ALiu, LYang, KBryan, MCAndrews, KLBo, YBooker, SKCaenepeel, SFreeman, DLiao, HMcCarter, JMullady, ELSan Miguel, TSubramanian, RTamayo, NWang, LWhittington, DAZalameda, LZhang, NHughes, PENorman, MH Phospshoinositide 3-kinase (PI3K)/mammalian target of rapamycin (mTOR) dual inhibitors: discovery and structure-activity relationships of a series of quinoline and quinoxaline derivatives. J Med Chem54:4735-51 (2011) 
 
Phosphatidylinositol 4,5-bisphosphate 3-kinase catalytic subunit alpha isoform
Name:Phosphatidylinositol 4,5-bisphosphate 3-kinase catalytic subunit alpha isoform
Type:Enzyme Subunit
Mol. Mass.:124294.87
Organism:Homo sapiens (Human)
Description:P42336
Residue:1068
BDBM50357665
NameBDBM50357665
Synonyms:CHEMBL1914728
TypeSmall organic molecule
Emp. Form.C28H22ClFN4O2S
Mol. Mass.533.016
SMILESCN(C)c1ccc(cc1)-c1ccnc2ccc(cc12)-c1cnc(Cl)c(NS(=O)(=O)c2ccc(F)cc2)c1