Reaction Details
TargetPhosphatidylinositol 4,5-bisphosphate 3-kinase catalytic subunit delta isoform
LigandBDBM50357645
Substrate/Competitorn/a
Meas. Tech.ChEMBL_786053 (CHEMBL1919684)
IC50 4.3±n/a nM
Citation Nishimura, NSiegmund, ALiu, LYang, KBryan, MCAndrews, KLBo, YBooker, SKCaenepeel, SFreeman, DLiao, HMcCarter, JMullady, ELSan Miguel, TSubramanian, RTamayo, NWang, LWhittington, DAZalameda, LZhang, NHughes, PENorman, MH Phospshoinositide 3-kinase (PI3K)/mammalian target of rapamycin (mTOR) dual inhibitors: discovery and structure-activity relationships of a series of quinoline and quinoxaline derivatives. J Med Chem54:4735-51 (2011) 
 
Phosphatidylinositol 4,5-bisphosphate 3-kinase catalytic subunit delta isoform
Name:Phosphatidylinositol 4,5-bisphosphate 3-kinase catalytic subunit delta isoform
Type:Enzyme Subunit
Mol. Mass.:119489.41
Organism:Homo sapiens (Human)
Description:O00329
Residue:1044
BDBM50357645
NameBDBM50357645
Synonyms:CHEMBL1738719
TypeSmall organic molecule
Emp. Form.C24H20ClFN4O3S
Mol. Mass.498.957
SMILESFc1ccc(cc1)S(=O)(=O)Nc1cc(cnc1Cl)-c1ccc2nccc(N3CCOCC3)c2c1