Reaction Details
TargetSerine/threonine-protein kinase mTOR
LigandBDBM50357650
Substrate/Competitorn/a
Meas. Tech.ChEMBL_786054 (CHEMBL1919685)
IC50 37±n/a nM
Citation Nishimura, NSiegmund, ALiu, LYang, KBryan, MCAndrews, KLBo, YBooker, SKCaenepeel, SFreeman, DLiao, HMcCarter, JMullady, ELSan Miguel, TSubramanian, RTamayo, NWang, LWhittington, DAZalameda, LZhang, NHughes, PENorman, MH Phospshoinositide 3-kinase (PI3K)/mammalian target of rapamycin (mTOR) dual inhibitors: discovery and structure-activity relationships of a series of quinoline and quinoxaline derivatives. J Med Chem54:4735-51 (2011) 
 
Serine/threonine-protein kinase mTOR
Name:Serine/threonine-protein kinase mTOR
Type:Rapamycin target protein
Mol. Mass.:288917.12
Organism:Homo sapiens (Human)
Description:P42345
Residue:2549
BDBM50357650
NameBDBM50357650
Synonyms:CHEMBL1914742
TypeSmall organic molecule
Emp. Form.C26H26ClFN6O2S
Mol. Mass.541.04
SMILESCC(C)N1CCN(CC1)c1cnc2ccc(cc2n1)-c1cnc(Cl)c(NS(=O)(=O)c2ccc(F)cc2)c1