Reaction Details
TargetDNA topoisomerase 2-alpha
LigandBDBM50357677
Substrate/Competitorn/a
Meas. Tech.ChEMBL_786340 (CHEMBL1920536)
Ki 75000±n/a nM
Citation Baviskar, ATMadaan, CPreet, RMohapatra, PJain, VAgarwal, AGuchhait, SKKundu, CNBanerjee, UCBharatam, PV N-fused imidazoles as novel anticancer agents that inhibit catalytic activity of topoisomerase IIa and induce apoptosis in G1/S phase. J Med Chem54:5013-30 (2011) 
 
DNA topoisomerase 2-alpha
Name:DNA topoisomerase 2-alpha
Type:Protein
Mol. Mass.:174415.30
Organism:Homo sapiens (Human)
Description:P11388
Residue:1531
BDBM50357677
NameBDBM50357677
Synonyms:CHEMBL1914951
TypeSmall organic molecule
Emp. Form.C18H19N3O2
Mol. Mass.309.3624
SMILESCC(C)(C)Nc1c(nc2ccccn12)-c1ccc(cc1)C(O)=O