Reaction Details
TargetNitric oxide synthase, brain
LigandBDBM50357690
Substrate/Competitorn/a
Meas. Tech.ChEMBL_785761 (CHEMBL1920781)
IC50 93±n/a nM
Citation Ramnauth, JSpeed, JMaddaford, SPDove, PAnnedi, SCRenton, PRakhit, SAndrews, JSilverman, SMladenova, GZinghini, SNair, SCatalano, CLee, DKDe Felice, MPorreca, F Design, synthesis, and biological evaluation of 3,4-dihydroquinolin-2(1H)-one and 1,2,3,4-tetrahydroquinoline-based selective human neuronal nitric oxide synthase (nNOS) inhibitors. J Med Chem54:5562-75 (2011) 
 
Nitric oxide synthase, brain
Name:Nitric oxide synthase, brain
Type:Homodimer
Mol. Mass.:160985.98
Organism:Homo sapiens (Human)
Description:P29475
Residue:1434
BDBM50357690
NameBDBM50357690
Synonyms:CHEMBL1915286
TypeSmall organic molecule
Emp. Form.C18H23FN4S
Mol. Mass.346.465
SMILESCN(C)CCN1CCCc2cc(cc(F)c12)N=C(N)c1cccs1