Reaction Details
TargetLaccase
LigandBDBM26985
Substrate/Competitorn/a
Meas. Tech.ChEMBL_786157 (CHEMBL1919991)
IC50 279000±n/a nM
Citation Dalisay, DSSaludes, JPMolinski, TF Ptilomycalin A inhibits laccase and melanization in Cryptococcus neoformans. Bioorg Med Chem19:6654-7 (2011) 
 
Laccase
Name:Laccase
Synonyms:n/a
Type:PROTEIN
Mol. Mass.:55472.53
Organism:Trametes versicolor
Description:ChEMBL_786157
Residue:520
BDBM26985
NameBDBM26985
TypeIon
Emp. Form.N3
Mol. Mass.42.0206
SMILES[N-]=[N+]=[N-]